execute mvn clean package
you will see
[ERROR] Tests run: 2, Failures: 0, Errors: 1, Skipped: 1, Time elapsed: 31.13 s <<< FAILURE! -- in org.acme.GreetingResourceTest
[ERROR] org.acme.GreetingResourceTest.jmsHelloEndpoint -- Time elapsed: 0.010 s <<< ERROR!
java.lang.RuntimeException: java.lang.RuntimeException: Failed to start quarkus
at io.quarkus.test.junit.QuarkusTestExtension.throwBootFailureException(QuarkusTestExtension.java:611)
at io.quarkus.test.junit.QuarkusTestExtension.interceptTestClassConstructor(QuarkusTestExtension.java:695)
at java.base/java.util.Optional.orElseGet(Optional.java:364)
at java.base/java.util.ArrayList.forEach(ArrayList.java:1596)
at java.base/java.util.ArrayList.forEach(ArrayList.java:1596)
Caused by: java.lang.RuntimeException: Failed to start quarkus
at io.quarkus.runner.ApplicationImpl.doStart(Unknown Source)
at io.quarkus.runtime.Application.start(Application.java:101)
at java.base/java.lang.reflect.Method.invoke(Method.java:580)
at io.quarkus.runner.bootstrap.StartupActionImpl.run(StartupActionImpl.java:305)
at io.quarkus.test.junit.QuarkusTestExtension.doJavaStart(QuarkusTestExtension.java:224)
at io.quarkus.test.junit.QuarkusTestExtension.ensureStarted(QuarkusTestExtension.java:578)
at io.quarkus.test.junit.QuarkusTestExtension.beforeAll(QuarkusTestExtension.java:628)
... 1 more
Caused by: java.lang.IllegalStateException: Configuration foo: url is not set and devservices is activated. This is a bug. Please report it.
at io.quarkus.artemis.core.runtime.ArtemisUtil.validateIntegrity(ArtemisUtil.java:30)
at io.quarkus.artemis.jms.runtime.ArtemisJmsRecorder.getConnectionFactoryProducer(ArtemisJmsRecorder.java:33)
at io.quarkus.runner.recorded.ArtemisJmsProcessor$configure1243796012.deploy_0(Unknown Source)
at io.quarkus.runner.recorded.ArtemisJmsProcessor$configure1243796012.deploy(Unknown Source)
... 8 more
now rename application.properties.old
into application.properties
then application.yaml
into application.yaml.old
and execute again mvn clean package
; it succeeds