Use BuiltinRootNode.ArgNode
to extract argument for a builtin method
#759
bazel-build.yml
on: pull_request
Run bazel GUI build
4m 51s
Annotations
21 errors
org.enso.interpreter.test.instrument.RuntimeErrorsTest ► should continue execution after thrown panics:
/runner/_work/enso/enso/target/test-results/TEST-org.enso.interpreter.test.instrument.RuntimeErrorsTest.xml#L0
Failed test found in:
/runner/_work/enso/enso/target/test-results/TEST-org.enso.interpreter.test.instrument.RuntimeErrorsTest.xml
Error:
org.scalatest.exceptions.TestFailedException: List(Response(Some(a553f915-0d68-489e-be9c-d716d027aa04), PushContextResponse(b86d13a8-c9c0-4e2c-a977-938cc0f05dba)), Response(None, ExpressionUpdates(b86d13a8-c9c0-4e2c-a977-938cc0f05dba, Set(ExpressionUpdate(00000000-0000-00aa-2668-e0e123744529, Some(Vector("Standard.Base.Panic.Panic")), Some(MethodCall(MethodPointer("Standard.Base.Panic", "Standard.Base.Panic.Panic", "throw"), Vector())), Vector(ExecutionTime(0)), false, true, Panic("MyError", List(00000000-0000-00aa-2668-e0e123744529)))))), Response(None, ExpressionUpdates(b86d13a8-c9c0-4e2c-a977-938cc0f05dba, Set(ExpressionUpdate(6f415add-8cd0-4a01-8385-4b95d9e320a1, Some(Vector("Standard.Base.Panic.Panic")), None, Vector(ExecutionTime(0)), false, true, Panic("MyError", List(00000000-0000-00aa-2668-e0e123744529)))))), Response(None, ExpressionUpdates(b86d13a8-c9c0-4e2c-a977-938cc0f05dba, Set(ExpressionUpdate(8ecf5a50-cb06-44a0-b915-8d1252763a2f, Some(Vector("Standard.Base.Panic.Panic")), Some(MethodCall(MethodPointer("Standard.Base.IO", "Standard.Base.IO", "println"), Vector())), Vector(ExecutionTime(0)), false, true, Panic("MyError", List(8ecf5a50-cb06-44a0-b915-8d1252763a2f)))))), Response(None, ExecutionComplete(b86d13a8-c9c0-4e2c-a977-938cc0f05dba))) did not contain the same elements as List(Response(Some(a553f915-0d68-489e-be9c-d716d027aa04), PushContextResponse(b86d13a8-c9c0-4e2c-a977-938cc0f05dba)), Response(None, ExpressionUpdates(b86d13a8-c9c0-4e2c-a977-938cc0f05dba, Set(ExpressionUpdate(00000000-0000-00aa-2668-e0e123744529, Some(Vector("Standard.Base.Panic.Panic")), Some(MethodCall(MethodPointer("Standard.Base.Panic", "Standard.Base.Panic.Panic", "throw"), Vector())), Vector(ExecutionTime(0)), false, true, Panic("MyError", List(00000000-0000-00aa-2668-e0e123744529)))))), Response(None, ExpressionUpdates(b86d13a8-c9c0-4e2c-a977-938cc0f05dba, Set(ExpressionUpdate(6f415add-8cd0-4a01-8385-4b95d9e320a1, Some(Vector("Standard.Base.Panic.Panic")), None, Vector(ExecutionTime(0)), false, true, Panic("MyError", List(00000000-0000-00aa-2668-e0e123744529)))))), Response(None, ExpressionUpdates(b86d13a8-c9c0-4e2c-a977-938cc0f05dba, Set(ExpressionUpdate(8ecf5a50-cb06-44a0-b915-8d1252763a2f, Some(Vector("Standard.Base.Panic.Panic")), Some(MethodCall(MethodPointer("Standard.Base.IO", "Standard.Base.IO", "println"), Vector())), Vector(ExecutionTime(0)), false, true, Panic("MyError", List(00000000-0000-00aa-2668-e0e123744529)))))), Response(None, ExecutionComplete(b86d13a8-c9c0-4e2c-a977-938cc0f05dba)))
|
org.enso.interpreter.test.instrument.RuntimeErrorsTest ► should continue execution after panics in expressions:
/runner/_work/enso/enso/target/test-results/TEST-org.enso.interpreter.test.instrument.RuntimeErrorsTest.xml#L0
Failed test found in:
/runner/_work/enso/enso/target/test-results/TEST-org.enso.interpreter.test.instrument.RuntimeErrorsTest.xml
Error:
org.scalatest.exceptions.TestFailedException: List(Response(Some(ab4d4f62-5141-42ef-848f-a19485999856), PushContextResponse(60337e04-c2f7-4729-951c-cf72ac7534bf)), Response(None, ExecutionUpdate(60337e04-c2f7-4729-951c-cf72ac7534bf, List(Diagnostic(Error, Some("The name `foo` could not be found."), Some(/tmp/enso-test-packages1980540912809320291/src/Main.enso), Some(Range(Position(3, 12), Position(3, 15))), None, Vector())))), Response(None, ExpressionUpdates(60337e04-c2f7-4729-951c-cf72ac7534bf, Set(ExpressionUpdate(26e28957-8c55-4b17-a468-c06c4f70c58c, Some(Vector("Standard.Base.Panic.Panic")), None, Vector(ExecutionTime(0)), false, true, Panic("Compile error: The name `foo` could not be found.", List(26e28957-8c55-4b17-a468-c06c4f70c58c)))))), Response(None, ExpressionUpdates(60337e04-c2f7-4729-951c-cf72ac7534bf, Set(ExpressionUpdate(dc56e413-66d7-4f19-816a-54f29cd0d59e, Some(Vector("Standard.Base.Panic.Panic")), None, Vector(ExecutionTime(0)), false, true, Panic("Compile error: The name `foo` could not be found.", List(26e28957-8c55-4b17-a468-c06c4f70c58c)))))), Response(None, ExpressionUpdates(60337e04-c2f7-4729-951c-cf72ac7534bf, Set(ExpressionUpdate(10e302f3-5311-463f-b8d2-75c3d798f756, Some(Vector("Standard.Base.Panic.Panic")), Some(MethodCall(MethodPointer("Standard.Base.IO", "Standard.Base.IO", "println"), Vector())), Vector(ExecutionTime(0)), false, true, Panic("Compile error: The name `foo` could not be found.", List(10e302f3-5311-463f-b8d2-75c3d798f756)))))), Response(None, ExecutionComplete(60337e04-c2f7-4729-951c-cf72ac7534bf))) did not contain the same elements as List(Response(Some(ab4d4f62-5141-42ef-848f-a19485999856), PushContextResponse(60337e04-c2f7-4729-951c-cf72ac7534bf)), Response(None, ExecutionUpdate(60337e04-c2f7-4729-951c-cf72ac7534bf, List(Diagnostic(Error, Some("The name `foo` could not be found."), Some(/tmp/enso-test-packages1980540912809320291/src/Main.enso), Some(Range(Position(3, 12), Position(3, 15))), None, Vector())))), Response(None, ExpressionUpdates(60337e04-c2f7-4729-951c-cf72ac7534bf, Set(ExpressionUpdate(26e28957-8c55-4b17-a468-c06c4f70c58c, Some(Vector("Standard.Base.Panic.Panic")), None, Vector(ExecutionTime(0)), false, true, Panic("Compile error: The name `foo` could not be found.", List(26e28957-8c55-4b17-a468-c06c4f70c58c)))))), Response(None, ExpressionUpdates(60337e04-c2f7-4729-951c-cf72ac7534bf, Set(ExpressionUpdate(dc56e413-66d7-4f19-816a-54f29cd0d59e, Some(Vector("Standard.Base.Panic.Panic")), None, Vector(ExecutionTime(0)), false, true, Panic("Compile error: The name `foo` could not be found.", List(26e28957-8c55-4b17-a468-c06c4f70c58c)))))), Response(None, ExpressionUpdates(60337e04-c2f7-4729-951c-cf72ac7534bf, Set(ExpressionUpdate(10e302f3-5311-463f-b8d2-75c3d798f756, Some(Vector("Standard.Base.Panic.Panic")), Some(MethodCall(MethodPointer("Standard.Base.IO", "Standard.Base.IO", "println"), Vector())), Vector(ExecutionTime(0)), false, true, Panic("Compile error: The name `foo` could not be found.", List(26e28957-8c55-4b17-a468-c06c4f70c58c)))))), Response(None, ExecutionComplete(60337e04-c2f7-4729-951c-cf72ac7534bf)))
|
org.enso.interpreter.test.instrument.RuntimeErrorsTest ► should send updates when panic changes in expression:
/runner/_work/enso/enso/target/test-results/TEST-org.enso.interpreter.test.instrument.RuntimeErrorsTest.xml#L0
Failed test found in:
/runner/_work/enso/enso/target/test-results/TEST-org.enso.interpreter.test.instrument.RuntimeErrorsTest.xml
Error:
org.scalatest.exceptions.TestFailedException: List(Response(Some(b2c56950-1cce-450a-8d12-fb8298157860), PushContextResponse(218bcfe1-c855-4c41-9a25-028b5b07d70a)), Response(None, ExpressionUpdates(218bcfe1-c855-4c41-9a25-028b5b07d70a, Set(ExpressionUpdate(ea5fc26c-ec00-457a-a735-deec8aa9f5b4, Some(Vector("Standard.Base.Panic.Panic")), Some(MethodCall(MethodPointer("Standard.Base.Panic", "Standard.Base.Panic.Panic", "throw"), Vector())), Vector(ExecutionTime(0)), false, true, Panic("MyError1", List(ea5fc26c-ec00-457a-a735-deec8aa9f5b4)))))), Response(None, ExpressionUpdates(218bcfe1-c855-4c41-9a25-028b5b07d70a, Set(ExpressionUpdate(d153a9e0-59d9-4ea0-bb2d-3962106b9209, Some(Vector("Standard.Base.Panic.Panic")), None, Vector(ExecutionTime(0)), false, true, Panic("MyError1", List(ea5fc26c-ec00-457a-a735-deec8aa9f5b4)))))), Response(None, ExpressionUpdates(218bcfe1-c855-4c41-9a25-028b5b07d70a, Set(ExpressionUpdate(812abe6b-a94f-4d8c-96c1-4590c553d845, Some(Vector("Standard.Base.Panic.Panic")), Some(MethodCall(MethodPointer("Standard.Base.IO", "Standard.Base.IO", "println"), Vector())), Vector(ExecutionTime(0)), false, true, Panic("MyError1", List(812abe6b-a94f-4d8c-96c1-4590c553d845)))))), Response(None, ExecutionComplete(218bcfe1-c855-4c41-9a25-028b5b07d70a))) did not contain the same elements as List(Response(Some(b2c56950-1cce-450a-8d12-fb8298157860), PushContextResponse(218bcfe1-c855-4c41-9a25-028b5b07d70a)), Response(None, ExpressionUpdates(218bcfe1-c855-4c41-9a25-028b5b07d70a, Set(ExpressionUpdate(ea5fc26c-ec00-457a-a735-deec8aa9f5b4, Some(Vector("Standard.Base.Panic.Panic")), Some(MethodCall(MethodPointer("Standard.Base.Panic", "Standard.Base.Panic.Panic", "throw"), Vector())), Vector(ExecutionTime(0)), false, true, Panic("MyError1", List(ea5fc26c-ec00-457a-a735-deec8aa9f5b4)))))), Response(None, ExpressionUpdates(218bcfe1-c855-4c41-9a25-028b5b07d70a, Set(ExpressionUpdate(d153a9e0-59d9-4ea0-bb2d-3962106b9209, Some(Vector("Standard.Base.Panic.Panic")), None, Vector(ExecutionTime(0)), false, true, Panic("MyError1", List(ea5fc26c-ec00-457a-a735-deec8aa9f5b4)))))), Response(None, ExpressionUpdates(218bcfe1-c855-4c41-9a25-028b5b07d70a, Set(ExpressionUpdate(812abe6b-a94f-4d8c-96c1-4590c553d845, Some(Vector("Standard.Base.Panic.Panic")), Some(MethodCall(MethodPointer("Standard.Base.IO", "Standard.Base.IO", "println"), Vector())), Vector(ExecutionTime(0)), false, true, Panic("MyError1", List(ea5fc26c-ec00-457a-a735-deec8aa9f5b4)))))), Response(None, ExecutionComplete(218bcfe1-c855-4c41-9a25-028b5b07d70a)))
|
org.enso.interpreter.test.instrument.RuntimeErrorsTest ► should send updates when panic is resolved in method:
/runner/_work/enso/enso/target/test-results/TEST-org.enso.interpreter.test.instrument.RuntimeErrorsTest.xml#L0
Failed test found in:
/runner/_work/enso/enso/target/test-results/TEST-org.enso.interpreter.test.instrument.RuntimeErrorsTest.xml
Error:
org.scalatest.exceptions.TestFailedException: List(Response(Some(ce8bd2a9-87f6-4b19-9cd2-5a31b2a63cb4), PushContextResponse(b4e64254-2878-4187-bb00-ac0b112ed58a)), Response(None, ExpressionUpdates(b4e64254-2878-4187-bb00-ac0b112ed58a, Set(ExpressionUpdate(f1c95809-9704-4824-aac4-6023bf23623d, Some(Vector("Standard.Base.Panic.Panic")), Some(MethodCall(MethodPointer("Enso_Test.Test.Main", "Enso_Test.Test.Main", "foo"), Vector())), Vector(ExecutionTime(0)), false, true, Panic("Integer", List(f1c95809-9704-4824-aac4-6023bf23623d)))))), Response(None, ExpressionUpdates(b4e64254-2878-4187-bb00-ac0b112ed58a, Set(ExpressionUpdate(89097432-6b5e-4ee1-8e4a-1187a8a92348, Some(Vector("Standard.Base.Panic.Panic")), None, Vector(ExecutionTime(0)), false, true, Panic("Integer", List(f1c95809-9704-4824-aac4-6023bf23623d)))))), Response(None, ExpressionUpdates(b4e64254-2878-4187-bb00-ac0b112ed58a, Set(ExpressionUpdate(6c3fc1c2-4a5e-43b7-8afd-403d42593918, Some(Vector("Standard.Base.Panic.Panic")), Some(MethodCall(MethodPointer("Standard.Base.IO", "Standard.Base.IO", "println"), Vector())), Vector(ExecutionTime(0)), false, true, Panic("Integer", List(6c3fc1c2-4a5e-43b7-8afd-403d42593918)))))), Response(None, ExecutionComplete(b4e64254-2878-4187-bb00-ac0b112ed58a))) did not contain the same elements as List(Response(Some(ce8bd2a9-87f6-4b19-9cd2-5a31b2a63cb4), PushContextResponse(b4e64254-2878-4187-bb00-ac0b112ed58a)), Response(None, ExpressionUpdates(b4e64254-2878-4187-bb00-ac0b112ed58a, Set(ExpressionUpdate(f1c95809-9704-4824-aac4-6023bf23623d, Some(Vector("Standard.Base.Panic.Panic")), Some(MethodCall(MethodPointer("Enso_Test.Test.Main", "Enso_Test.Test.Main", "foo"), Vector())), Vector(ExecutionTime(0)), false, true, Panic("Integer", List(f1c95809-9704-4824-aac4-6023bf23623d)))))), Response(None, ExpressionUpdates(b4e64254-2878-4187-bb00-ac0b112ed58a, Set(ExpressionUpdate(89097432-6b5e-4ee1-8e4a-1187a8a92348, Some(Vector("Standard.Base.Panic.Panic")), None, Vector(ExecutionTime(0)), false, true, Panic("Integer", List(f1c95809-9704-4824-aac4-6023bf23623d)))))), Response(None, ExpressionUpdates(b4e64254-2878-4187-bb00-ac0b112ed58a, Set(ExpressionUpdate(6c3fc1c2-4a5e-43b7-8afd-403d42593918, Some(Vector("Standard.Base.Panic.Panic")), Some(MethodCall(MethodPointer("Standard.Base.IO", "Standard.Base.IO", "println"), Vector())), Vector(ExecutionTime(0)), false, true, Panic("Integer", List(f1c95809-9704-4824-aac4-6023bf23623d)))))), Response(None, ExecutionComplete(b4e64254-2878-4187-bb00-ac0b112ed58a)))
|
org.enso.interpreter.test.instrument.RuntimeVisualizationsTest ► should run visualization expression propagating panic:
/runner/_work/enso/enso/target/test-results/TEST-org.enso.interpreter.test.instrument.RuntimeVisualizationsTest.xml#L0
Failed test found in:
/runner/_work/enso/enso/target/test-results/TEST-org.enso.interpreter.test.instrument.RuntimeVisualizationsTest.xml
Error:
org.scalatest.exceptions.TestFailedException: List(Response(Some(47c2b632-f62c-42d0-8ce5-599da5d1afd0), VisualizationAttached()), Response(None, ExpressionUpdates(cf81a68e-9c25-4c51-a8a2-6becc1e6cc2b, Set(ExpressionUpdate(aa078a13-8e30-4359-bfba-1d89fae53661, Some(Vector("Standard.Base.Panic.Panic")), Some(MethodCall(MethodPointer("Standard.Base.Panic", "Standard.Base.Panic.Panic", "throw"), Vector())), Vector(ExecutionTime(0)), false, true, Panic("Integer", List(aa078a13-8e30-4359-bfba-1d89fae53661)))))), Response(None, VisualizationEvaluationFailed(VisualizationContext(2ae2a22a-23df-4590-b07b-9914fb9d32e6, cf81a68e-9c25-4c51-a8a2-6becc1e6cc2b, aa078a13-8e30-4359-bfba-1d89fae53661), "42", Some(Diagnostic(Error, Some("42"), None, None, None, Vector(StackTraceElement("<inline_source>.Enso_Test.Test.Main", Some(/tmp/enso-test-packages519358695811057433/src/Main.enso), Some(Range(Position(3, 4), Position(3, 18))), Some(aa078a13-8e30-4359-bfba-1d89fae53661))))))), Response(None, ExecutionComplete(cf81a68e-9c25-4c51-a8a2-6becc1e6cc2b))) did not contain the same elements as List(Response(Some(47c2b632-f62c-42d0-8ce5-599da5d1afd0), VisualizationAttached()), Response(None, ExpressionUpdates(cf81a68e-9c25-4c51-a8a2-6becc1e6cc2b, Set(ExpressionUpdate(aa078a13-8e30-4359-bfba-1d89fae53661, Some(Vector("Standard.Base.Panic.Panic")), Some(MethodCall(MethodPointer("Standard.Base.Panic", "Standard.Base.Panic.Panic", "throw"), Vector())), Vector(ExecutionTime(0)), false, true, Panic("Integer", List(aa078a13-8e30-4359-bfba-1d89fae53661)))))), Response(None, VisualizationEvaluationFailed(VisualizationContext(2ae2a22a-23df-4590-b07b-9914fb9d32e6, cf81a68e-9c25-4c51-a8a2-6becc1e6cc2b, aa078a13-8e30-4359-bfba-1d89fae53661), "42", Some(Diagnostic(Error, Some("42"), Some(/tmp/enso-test-packages519358695811057433/src/Main.enso), Some(Range(Position(3, 4), Position(3, 18))), Some(aa078a13-8e30-4359-bfba-1d89fae53661), Vector(StackTraceElement("Main.main", Some(/tmp/enso-test-packages519358695811057433/src/Main.enso), Some(Range(Position(3, 4), Position(3, 18))), Some(aa078a13-8e30-4359-bfba-1d89fae53661))))))), Response(None, ExecutionComplete(cf81a68e-9c25-4c51-a8a2-6becc1e6cc2b)))
|
Dataflow Warnings ► should be allowed in Vector:
C:/runner/_work/enso/enso/target/test-results/Base_Tests/JUnit.xml#L0
Failed test found in:
C:/runner/_work/enso/enso/target/test-results/Base_Tests/JUnit.xml
Error:
['d', 'b', 'a'] did not equal [(Map_Error.Error 1 'b'), (Map_Error.Error 0 'a'), 'd']; first difference at index 0 (at Base_Tests\src\Semantic\Warnings_Spec.enso:272:9-126).
|
Dataflow Warnings ► should be preserved after operations on Vector:
C:/runner/_work/enso/enso/target/test-results/Base_Tests/JUnit.xml#L0
Failed test found in:
C:/runner/_work/enso/enso/target/test-results/Base_Tests/JUnit.xml
Error:
['warn4', 'warn3', 'warn2', 'warn1'] did not equal [(Map_Error.Error 3 'warn4'), (Map_Error.Error 2 'warn3'), (Map_Error.Error 1 'warn2'), (Map_Error.Error 0 'warn1')]; first difference at index 0 (at Base_Tests\src\Semantic\Warnings_Spec.enso:284:9-191).
|
Dataflow Warnings ► should be allowed in Vector:
/runner/_work/enso/enso/target/test-results/Base_Tests/JUnit.xml#L0
Failed test found in:
/runner/_work/enso/enso/target/test-results/Base_Tests/JUnit.xml
Error:
['d', 'b', 'a'] did not equal [(Map_Error.Error 1 'b'), (Map_Error.Error 0 'a'), 'd']; first difference at index 0 (at Base_Tests/src/Semantic/Warnings_Spec.enso:272:9-126).
|
Dataflow Warnings ► should be preserved after operations on Vector:
/runner/_work/enso/enso/target/test-results/Base_Tests/JUnit.xml#L0
Failed test found in:
/runner/_work/enso/enso/target/test-results/Base_Tests/JUnit.xml
Error:
['warn4', 'warn3', 'warn2', 'warn1'] did not equal [(Map_Error.Error 3 'warn4'), (Map_Error.Error 2 'warn3'), (Map_Error.Error 1 'warn2'), (Map_Error.Error 0 'warn1')]; first difference at index 0 (at Base_Tests/src/Semantic/Warnings_Spec.enso:284:9-191).
|
Dataflow Warnings ► should be allowed in Vector:
/Users/runner/work/enso/enso/target/test-results/Base_Tests/JUnit.xml#L0
Failed test found in:
/Users/runner/work/enso/enso/target/test-results/Base_Tests/JUnit.xml
Error:
['d', 'b', 'a'] did not equal [(Map_Error.Error 1 'b'), (Map_Error.Error 0 'a'), 'd']; first difference at index 0 (at Base_Tests/src/Semantic/Warnings_Spec.enso:272:9-126).
|
Dataflow Warnings ► should be preserved after operations on Vector:
/Users/runner/work/enso/enso/target/test-results/Base_Tests/JUnit.xml#L0
Failed test found in:
/Users/runner/work/enso/enso/target/test-results/Base_Tests/JUnit.xml
Error:
['warn4', 'warn3', 'warn2', 'warn1'] did not equal [(Map_Error.Error 3 'warn4'), (Map_Error.Error 2 'warn3'), (Map_Error.Error 1 'warn2'), (Map_Error.Error 0 'warn1')]; first difference at index 0 (at Base_Tests/src/Semantic/Warnings_Spec.enso:284:9-191).
|
org.enso.interpreter.test.instrument.RuntimeErrorsTest ► should continue execution after thrown panics:
C:/runner/_work/enso/enso/target/test-results/TEST-org.enso.interpreter.test.instrument.RuntimeErrorsTest.xml#L0
Failed test found in:
C:/runner/_work/enso/enso/target/test-results/TEST-org.enso.interpreter.test.instrument.RuntimeErrorsTest.xml
Error:
org.scalatest.exceptions.TestFailedException: List(Response(Some(6050dda3-6ffa-4e3e-b268-3d3a929cd9bc), PushContextResponse(5f867078-a7ac-448b-9470-8828724d9980)), Response(None, ExpressionUpdates(5f867078-a7ac-448b-9470-8828724d9980, Set(ExpressionUpdate(00000000-0000-00aa-3094-73ce80b64324, Some(Vector("Standard.Base.Panic.Panic")), Some(MethodCall(MethodPointer("Standard.Base.Panic", "Standard.Base.Panic.Panic", "throw"), Vector())), Vector(ExecutionTime(0)), false, true, Panic("MyError", List(00000000-0000-00aa-3094-73ce80b64324)))))), Response(None, ExpressionUpdates(5f867078-a7ac-448b-9470-8828724d9980, Set(ExpressionUpdate(ec3437ff-9f1c-4e94-969f-439e08d39d2d, Some(Vector("Standard.Base.Panic.Panic")), None, Vector(ExecutionTime(0)), false, true, Panic("MyError", List(00000000-0000-00aa-3094-73ce80b64324)))))), Response(None, ExpressionUpdates(5f867078-a7ac-448b-9470-8828724d9980, Set(ExpressionUpdate(d810e7cf-9235-4f5e-8dc0-e79ced002a6a, Some(Vector("Standard.Base.Panic.Panic")), Some(MethodCall(MethodPointer("Standard.Base.IO", "Standard.Base.IO", "println"), Vector())), Vector(ExecutionTime(0)), false, true, Panic("MyError", List(d810e7cf-9235-4f5e-8dc0-e79ced002a6a)))))), Response(None, ExecutionComplete(5f867078-a7ac-448b-9470-8828724d9980))) did not contain the same elements as List(Response(Some(6050dda3-6ffa-4e3e-b268-3d3a929cd9bc), PushContextResponse(5f867078-a7ac-448b-9470-8828724d9980)), Response(None, ExpressionUpdates(5f867078-a7ac-448b-9470-8828724d9980, Set(ExpressionUpdate(00000000-0000-00aa-3094-73ce80b64324, Some(Vector("Standard.Base.Panic.Panic")), Some(MethodCall(MethodPointer("Standard.Base.Panic", "Standard.Base.Panic.Panic", "throw"), Vector())), Vector(ExecutionTime(0)), false, true, Panic("MyError", List(00000000-0000-00aa-3094-73ce80b64324)))))), Response(None, ExpressionUpdates(5f867078-a7ac-448b-9470-8828724d9980, Set(ExpressionUpdate(ec3437ff-9f1c-4e94-969f-439e08d39d2d, Some(Vector("Standard.Base.Panic.Panic")), None, Vector(ExecutionTime(0)), false, true, Panic("MyError", List(00000000-0000-00aa-3094-73ce80b64324)))))), Response(None, ExpressionUpdates(5f867078-a7ac-448b-9470-8828724d9980, Set(ExpressionUpdate(d810e7cf-9235-4f5e-8dc0-e79ced002a6a, Some(Vector("Standard.Base.Panic.Panic")), Some(MethodCall(MethodPointer("Standard.Base.IO", "Standard.Base.IO", "println"), Vector())), Vector(ExecutionTime(0)), false, true, Panic("MyError", List(00000000-0000-00aa-3094-73ce80b64324)))))), Response(None, ExecutionComplete(5f867078-a7ac-448b-9470-8828724d9980)))
|
org.enso.interpreter.test.instrument.RuntimeErrorsTest ► should continue execution after panics in expressions:
C:/runner/_work/enso/enso/target/test-results/TEST-org.enso.interpreter.test.instrument.RuntimeErrorsTest.xml#L0
Failed test found in:
C:/runner/_work/enso/enso/target/test-results/TEST-org.enso.interpreter.test.instrument.RuntimeErrorsTest.xml
Error:
org.scalatest.exceptions.TestFailedException: List(Response(Some(946024fe-11a1-426d-8727-609d660caf6b), PushContextResponse(68ffcc96-e1cb-4a35-b463-114ded7f8a00)), Response(None, ExecutionUpdate(68ffcc96-e1cb-4a35-b463-114ded7f8a00, List(Diagnostic(Error, Some("The name `foo` could not be found."), Some(C:\Users\ContainerAdministrator\AppData\Local\Temp\enso-test-packages3815751633758245247\src\Main.enso), Some(Range(Position(3, 12), Position(3, 15))), None, Vector())))), Response(None, ExpressionUpdates(68ffcc96-e1cb-4a35-b463-114ded7f8a00, Set(ExpressionUpdate(33012115-cd40-46de-ac56-2a917db17a02, Some(Vector("Standard.Base.Panic.Panic")), None, Vector(ExecutionTime(0)), false, true, Panic("Compile error: The name `foo` could not be found.", List(33012115-cd40-46de-ac56-2a917db17a02)))))), Response(None, ExpressionUpdates(68ffcc96-e1cb-4a35-b463-114ded7f8a00, Set(ExpressionUpdate(2a8fb67f-acc8-4ed9-9912-3ca165d378ef, Some(Vector("Standard.Base.Panic.Panic")), None, Vector(ExecutionTime(0)), false, true, Panic("Compile error: The name `foo` could not be found.", List(33012115-cd40-46de-ac56-2a917db17a02)))))), Response(None, ExpressionUpdates(68ffcc96-e1cb-4a35-b463-114ded7f8a00, Set(ExpressionUpdate(ce0c021c-2450-443e-879d-a1b4f983692c, Some(Vector("Standard.Base.Panic.Panic")), Some(MethodCall(MethodPointer("Standard.Base.IO", "Standard.Base.IO", "println"), Vector())), Vector(ExecutionTime(0)), false, true, Panic("Compile error: The name `foo` could not be found.", List(ce0c021c-2450-443e-879d-a1b4f983692c)))))), Response(None, ExecutionComplete(68ffcc96-e1cb-4a35-b463-114ded7f8a00))) did not contain the same elements as List(Response(Some(946024fe-11a1-426d-8727-609d660caf6b), PushContextResponse(68ffcc96-e1cb-4a35-b463-114ded7f8a00)), Response(None, ExecutionUpdate(68ffcc96-e1cb-4a35-b463-114ded7f8a00, List(Diagnostic(Error, Some("The name `foo` could not be found."), Some(C:\Users\ContainerAdministrator\AppData\Local\Temp\enso-test-packages3815751633758245247\src\Main.enso), Some(Range(Position(3, 12), Position(3, 15))), None, Vector())))), Response(None, ExpressionUpdates(68ffcc96-e1cb-4a35-b463-114ded7f8a00, Set(ExpressionUpdate(33012115-cd40-46de-ac56-2a917db17a02, Some(Vector("Standard.Base.Panic.Panic")), None, Vector(ExecutionTime(0)), false, true, Panic("Compile error: The name `foo` could not be found.", List(33012115-cd40-46de-ac56-2a917db17a02)))))), Response(None, ExpressionUpdates(68ffcc96-e1cb-4a35-b463-114ded7f8a00, Set(ExpressionUpdate(2a8fb67f-acc8-4ed9-9912-3ca165d378ef, Some(Vector("Standard.Base.Panic.Panic")), None, Vector(ExecutionTime(0)), false, true, Panic("Compile error: The name `foo` could not be found.", List(33012115-cd40-46de-ac56-2a917db17a02)))))), Response(None, ExpressionUpdates(68ffcc96-e1cb-4a35-b463-114ded7f8a00, Set(ExpressionUpdate(ce0c021c-2450-443e-879d-a1b4f983692c, Some(Vector("Standard.Base.Panic.Panic")), Some(MethodCall(MethodPointer("Standard.Base.IO", "Standard.Base.IO", "println"), Vector())), Vector(ExecutionTime(0)), false, true, Panic("Compile error: The name `foo` could not be found.", List(33012115-cd40-46de-ac56-2a917db17a02)))))), Response(None, ExecutionComplete(68ffcc96-e1cb-4a35-b463-114ded7f8a00)))
|
org.enso.interpreter.test.instrument.RuntimeErrorsTest ► should send updates when panic changes in expression:
C:/runner/_work/enso/enso/target/test-results/TEST-org.enso.interpreter.test.instrument.RuntimeErrorsTest.xml#L0
Failed test found in:
C:/runner/_work/enso/enso/target/test-results/TEST-org.enso.interpreter.test.instrument.RuntimeErrorsTest.xml
Error:
org.scalatest.exceptions.TestFailedException: List(Response(Some(9a4ca192-7a90-4f03-8a21-4f622262758c), PushContextResponse(6738888a-19ea-408e-841e-1699e094ad49)), Response(None, ExpressionUpdates(6738888a-19ea-408e-841e-1699e094ad49, Set(ExpressionUpdate(6ea6b71c-0631-4ab9-9718-4937c66f0914, Some(Vector("Standard.Base.Panic.Panic")), Some(MethodCall(MethodPointer("Standard.Base.Panic", "Standard.Base.Panic.Panic", "throw"), Vector())), Vector(ExecutionTime(0)), false, true, Panic("MyError1", List(6ea6b71c-0631-4ab9-9718-4937c66f0914)))))), Response(None, ExpressionUpdates(6738888a-19ea-408e-841e-1699e094ad49, Set(ExpressionUpdate(877f91ea-a0f1-4052-867d-3bb1a8f34fd8, Some(Vector("Standard.Base.Panic.Panic")), None, Vector(ExecutionTime(0)), false, true, Panic("MyError1", List(6ea6b71c-0631-4ab9-9718-4937c66f0914)))))), Response(None, ExpressionUpdates(6738888a-19ea-408e-841e-1699e094ad49, Set(ExpressionUpdate(c7fc4672-5182-4bac-a4bc-3a9b90d4957f, Some(Vector("Standard.Base.Panic.Panic")), Some(MethodCall(MethodPointer("Standard.Base.IO", "Standard.Base.IO", "println"), Vector())), Vector(ExecutionTime(0)), false, true, Panic("MyError1", List(c7fc4672-5182-4bac-a4bc-3a9b90d4957f)))))), Response(None, ExecutionComplete(6738888a-19ea-408e-841e-1699e094ad49))) did not contain the same elements as List(Response(Some(9a4ca192-7a90-4f03-8a21-4f622262758c), PushContextResponse(6738888a-19ea-408e-841e-1699e094ad49)), Response(None, ExpressionUpdates(6738888a-19ea-408e-841e-1699e094ad49, Set(ExpressionUpdate(6ea6b71c-0631-4ab9-9718-4937c66f0914, Some(Vector("Standard.Base.Panic.Panic")), Some(MethodCall(MethodPointer("Standard.Base.Panic", "Standard.Base.Panic.Panic", "throw"), Vector())), Vector(ExecutionTime(0)), false, true, Panic("MyError1", List(6ea6b71c-0631-4ab9-9718-4937c66f0914)))))), Response(None, ExpressionUpdates(6738888a-19ea-408e-841e-1699e094ad49, Set(ExpressionUpdate(877f91ea-a0f1-4052-867d-3bb1a8f34fd8, Some(Vector("Standard.Base.Panic.Panic")), None, Vector(ExecutionTime(0)), false, true, Panic("MyError1", List(6ea6b71c-0631-4ab9-9718-4937c66f0914)))))), Response(None, ExpressionUpdates(6738888a-19ea-408e-841e-1699e094ad49, Set(ExpressionUpdate(c7fc4672-5182-4bac-a4bc-3a9b90d4957f, Some(Vector("Standard.Base.Panic.Panic")), Some(MethodCall(MethodPointer("Standard.Base.IO", "Standard.Base.IO", "println"), Vector())), Vector(ExecutionTime(0)), false, true, Panic("MyError1", List(6ea6b71c-0631-4ab9-9718-4937c66f0914)))))), Response(None, ExecutionComplete(6738888a-19ea-408e-841e-1699e094ad49)))
|
org.enso.interpreter.test.instrument.RuntimeErrorsTest ► should send updates when panic is resolved in method:
C:/runner/_work/enso/enso/target/test-results/TEST-org.enso.interpreter.test.instrument.RuntimeErrorsTest.xml#L0
Failed test found in:
C:/runner/_work/enso/enso/target/test-results/TEST-org.enso.interpreter.test.instrument.RuntimeErrorsTest.xml
Error:
org.scalatest.exceptions.TestFailedException: List(Response(Some(f7b31283-d3f4-42b8-8b0c-ec919a11c172), PushContextResponse(ccec003d-a743-45f7-9484-e909713d0155)), Response(None, ExpressionUpdates(ccec003d-a743-45f7-9484-e909713d0155, Set(ExpressionUpdate(708862ee-7943-4e9d-ab3f-82c6421007dc, Some(Vector("Standard.Base.Panic.Panic")), Some(MethodCall(MethodPointer("Enso_Test.Test.Main", "Enso_Test.Test.Main", "foo"), Vector())), Vector(ExecutionTime(0)), false, true, Panic("Integer", List(708862ee-7943-4e9d-ab3f-82c6421007dc)))))), Response(None, ExpressionUpdates(ccec003d-a743-45f7-9484-e909713d0155, Set(ExpressionUpdate(f1e95e30-9390-4c50-87dc-861ae1ea6f73, Some(Vector("Standard.Base.Panic.Panic")), None, Vector(ExecutionTime(0)), false, true, Panic("Integer", List(708862ee-7943-4e9d-ab3f-82c6421007dc)))))), Response(None, ExpressionUpdates(ccec003d-a743-45f7-9484-e909713d0155, Set(ExpressionUpdate(5e72929e-9cf7-4387-92fb-2467453fe81b, Some(Vector("Standard.Base.Panic.Panic")), Some(MethodCall(MethodPointer("Standard.Base.IO", "Standard.Base.IO", "println"), Vector())), Vector(ExecutionTime(0)), false, true, Panic("Integer", List(5e72929e-9cf7-4387-92fb-2467453fe81b)))))), Response(None, ExecutionComplete(ccec003d-a743-45f7-9484-e909713d0155))) did not contain the same elements as List(Response(Some(f7b31283-d3f4-42b8-8b0c-ec919a11c172), PushContextResponse(ccec003d-a743-45f7-9484-e909713d0155)), Response(None, ExpressionUpdates(ccec003d-a743-45f7-9484-e909713d0155, Set(ExpressionUpdate(708862ee-7943-4e9d-ab3f-82c6421007dc, Some(Vector("Standard.Base.Panic.Panic")), Some(MethodCall(MethodPointer("Enso_Test.Test.Main", "Enso_Test.Test.Main", "foo"), Vector())), Vector(ExecutionTime(0)), false, true, Panic("Integer", List(708862ee-7943-4e9d-ab3f-82c6421007dc)))))), Response(None, ExpressionUpdates(ccec003d-a743-45f7-9484-e909713d0155, Set(ExpressionUpdate(f1e95e30-9390-4c50-87dc-861ae1ea6f73, Some(Vector("Standard.Base.Panic.Panic")), None, Vector(ExecutionTime(0)), false, true, Panic("Integer", List(708862ee-7943-4e9d-ab3f-82c6421007dc)))))), Response(None, ExpressionUpdates(ccec003d-a743-45f7-9484-e909713d0155, Set(ExpressionUpdate(5e72929e-9cf7-4387-92fb-2467453fe81b, Some(Vector("Standard.Base.Panic.Panic")), Some(MethodCall(MethodPointer("Standard.Base.IO", "Standard.Base.IO", "println"), Vector())), Vector(ExecutionTime(0)), false, true, Panic("Integer", List(708862ee-7943-4e9d-ab3f-82c6421007dc)))))), Response(None, ExecutionComplete(ccec003d-a743-45f7-9484-e909713d0155)))
|
org.enso.interpreter.test.instrument.RuntimeVisualizationsTest ► should run visualization expression propagating panic:
C:/runner/_work/enso/enso/target/test-results/TEST-org.enso.interpreter.test.instrument.RuntimeVisualizationsTest.xml#L0
Failed test found in:
C:/runner/_work/enso/enso/target/test-results/TEST-org.enso.interpreter.test.instrument.RuntimeVisualizationsTest.xml
Error:
org.scalatest.exceptions.TestFailedException: List(Response(Some(39e3e853-9328-436d-9892-6aac1239bcc0), VisualizationAttached()), Response(None, ExpressionUpdates(00b47e59-8e94-4669-8599-b622895a2634, Set(ExpressionUpdate(451c9876-43ad-4c26-9064-7212ceda7640, Some(Vector("Standard.Base.Panic.Panic")), Some(MethodCall(MethodPointer("Standard.Base.Panic", "Standard.Base.Panic.Panic", "throw"), Vector())), Vector(ExecutionTime(0)), false, true, Panic("Integer", List(451c9876-43ad-4c26-9064-7212ceda7640)))))), Response(None, VisualizationEvaluationFailed(VisualizationContext(56a850f1-0df5-4eef-af5f-97de15708834, 00b47e59-8e94-4669-8599-b622895a2634, 451c9876-43ad-4c26-9064-7212ceda7640), "42", Some(Diagnostic(Error, Some("42"), None, None, None, Vector(StackTraceElement("<inline_source>.Enso_Test.Test.Main", Some(C:\Users\ContainerAdministrator\AppData\Local\Temp\enso-test-packages2682051864089907678\src\Main.enso), Some(Range(Position(3, 4), Position(3, 18))), Some(451c9876-43ad-4c26-9064-7212ceda7640))))))), Response(None, ExecutionComplete(00b47e59-8e94-4669-8599-b622895a2634))) did not contain the same elements as List(Response(Some(39e3e853-9328-436d-9892-6aac1239bcc0), VisualizationAttached()), Response(None, ExpressionUpdates(00b47e59-8e94-4669-8599-b622895a2634, Set(ExpressionUpdate(451c9876-43ad-4c26-9064-7212ceda7640, Some(Vector("Standard.Base.Panic.Panic")), Some(MethodCall(MethodPointer("Standard.Base.Panic", "Standard.Base.Panic.Panic", "throw"), Vector())), Vector(ExecutionTime(0)), false, true, Panic("Integer", List(451c9876-43ad-4c26-9064-7212ceda7640)))))), Response(None, VisualizationEvaluationFailed(VisualizationContext(56a850f1-0df5-4eef-af5f-97de15708834, 00b47e59-8e94-4669-8599-b622895a2634, 451c9876-43ad-4c26-9064-7212ceda7640), "42", Some(Diagnostic(Error, Some("42"), Some(C:\Users\ContainerAdministrator\AppData\Local\Temp\enso-test-packages2682051864089907678\src\Main.enso), Some(Range(Position(3, 4), Position(3, 18))), Some(451c9876-43ad-4c26-9064-7212ceda7640), Vector(StackTraceElement("Main.main", Some(C:\Users\ContainerAdministrator\AppData\Local\Temp\enso-test-packages2682051864089907678\src\Main.enso), Some(Range(Position(3, 4), Position(3, 18))), Some(451c9876-43ad-4c26-9064-7212ceda7640))))))), Response(None, ExecutionComplete(00b47e59-8e94-4669-8599-b622895a2634)))
|
org.enso.interpreter.test.instrument.RuntimeErrorsTest ► should continue execution after thrown panics:
/Users/runner/work/enso/enso/target/test-results/TEST-org.enso.interpreter.test.instrument.RuntimeErrorsTest.xml#L0
Failed test found in:
/Users/runner/work/enso/enso/target/test-results/TEST-org.enso.interpreter.test.instrument.RuntimeErrorsTest.xml
Error:
org.scalatest.exceptions.TestFailedException: List(Response(Some(53a138d9-2420-4077-bc62-997ddac8378e), PushContextResponse(4a5a1cc3-cd2e-472e-98a2-503c4d6119be)), Response(None, ExpressionUpdates(4a5a1cc3-cd2e-472e-98a2-503c4d6119be, Set(ExpressionUpdate(00000000-0000-00aa-6ed8-092e78a643dc, Some(Vector("Standard.Base.Panic.Panic")), Some(MethodCall(MethodPointer("Standard.Base.Panic", "Standard.Base.Panic.Panic", "throw"), Vector())), Vector(ExecutionTime(0)), false, true, Panic("MyError", List(00000000-0000-00aa-6ed8-092e78a643dc)))))), Response(None, ExpressionUpdates(4a5a1cc3-cd2e-472e-98a2-503c4d6119be, Set(ExpressionUpdate(1bcdb6f0-35f6-4ddc-bd55-f4fb7de0945b, Some(Vector("Standard.Base.Panic.Panic")), None, Vector(ExecutionTime(0)), false, true, Panic("MyError", List(00000000-0000-00aa-6ed8-092e78a643dc)))))), Response(None, ExpressionUpdates(4a5a1cc3-cd2e-472e-98a2-503c4d6119be, Set(ExpressionUpdate(e2a85e42-3077-4c7b-98f0-e92b28223477, Some(Vector("Standard.Base.Panic.Panic")), Some(MethodCall(MethodPointer("Standard.Base.IO", "Standard.Base.IO", "println"), Vector())), Vector(ExecutionTime(0)), false, true, Panic("MyError", List(e2a85e42-3077-4c7b-98f0-e92b28223477)))))), Response(None, ExecutionComplete(4a5a1cc3-cd2e-472e-98a2-503c4d6119be))) did not contain the same elements as List(Response(Some(53a138d9-2420-4077-bc62-997ddac8378e), PushContextResponse(4a5a1cc3-cd2e-472e-98a2-503c4d6119be)), Response(None, ExpressionUpdates(4a5a1cc3-cd2e-472e-98a2-503c4d6119be, Set(ExpressionUpdate(00000000-0000-00aa-6ed8-092e78a643dc, Some(Vector("Standard.Base.Panic.Panic")), Some(MethodCall(MethodPointer("Standard.Base.Panic", "Standard.Base.Panic.Panic", "throw"), Vector())), Vector(ExecutionTime(0)), false, true, Panic("MyError", List(00000000-0000-00aa-6ed8-092e78a643dc)))))), Response(None, ExpressionUpdates(4a5a1cc3-cd2e-472e-98a2-503c4d6119be, Set(ExpressionUpdate(1bcdb6f0-35f6-4ddc-bd55-f4fb7de0945b, Some(Vector("Standard.Base.Panic.Panic")), None, Vector(ExecutionTime(0)), false, true, Panic("MyError", List(00000000-0000-00aa-6ed8-092e78a643dc)))))), Response(None, ExpressionUpdates(4a5a1cc3-cd2e-472e-98a2-503c4d6119be, Set(ExpressionUpdate(e2a85e42-3077-4c7b-98f0-e92b28223477, Some(Vector("Standard.Base.Panic.Panic")), Some(MethodCall(MethodPointer("Standard.Base.IO", "Standard.Base.IO", "println"), Vector())), Vector(ExecutionTime(0)), false, true, Panic("MyError", List(00000000-0000-00aa-6ed8-092e78a643dc)))))), Response(None, ExecutionComplete(4a5a1cc3-cd2e-472e-98a2-503c4d6119be)))
|
org.enso.interpreter.test.instrument.RuntimeErrorsTest ► should continue execution after panics in expressions:
/Users/runner/work/enso/enso/target/test-results/TEST-org.enso.interpreter.test.instrument.RuntimeErrorsTest.xml#L0
Failed test found in:
/Users/runner/work/enso/enso/target/test-results/TEST-org.enso.interpreter.test.instrument.RuntimeErrorsTest.xml
Error:
org.scalatest.exceptions.TestFailedException: List(Response(Some(108b992e-6b36-4502-88a3-6cd6eeb530a5), PushContextResponse(f70f6da6-f03b-4ba4-a225-8bb50e623261)), Response(None, ExecutionUpdate(f70f6da6-f03b-4ba4-a225-8bb50e623261, List(Diagnostic(Error, Some("The name `foo` could not be found."), Some(/var/folders/bq/77bm14_16vd4xfpb13_2w3q80000gn/T/enso-test-packages2371695501570739082/src/Main.enso), Some(Range(Position(3, 12), Position(3, 15))), None, Vector())))), Response(None, ExpressionUpdates(f70f6da6-f03b-4ba4-a225-8bb50e623261, Set(ExpressionUpdate(c3b294d2-3cee-4db9-87b5-af066dd76bfa, Some(Vector("Standard.Base.Panic.Panic")), None, Vector(ExecutionTime(0)), false, true, Panic("Compile error: The name `foo` could not be found.", List(c3b294d2-3cee-4db9-87b5-af066dd76bfa)))))), Response(None, ExpressionUpdates(f70f6da6-f03b-4ba4-a225-8bb50e623261, Set(ExpressionUpdate(06065f0d-a0ca-4c69-9d24-3519d644192e, Some(Vector("Standard.Base.Panic.Panic")), None, Vector(ExecutionTime(0)), false, true, Panic("Compile error: The name `foo` could not be found.", List(c3b294d2-3cee-4db9-87b5-af066dd76bfa)))))), Response(None, ExpressionUpdates(f70f6da6-f03b-4ba4-a225-8bb50e623261, Set(ExpressionUpdate(f0e5fc37-e729-4d9a-8af6-5365dd37a9b2, Some(Vector("Standard.Base.Panic.Panic")), Some(MethodCall(MethodPointer("Standard.Base.IO", "Standard.Base.IO", "println"), Vector())), Vector(ExecutionTime(0)), false, true, Panic("Compile error: The name `foo` could not be found.", List(f0e5fc37-e729-4d9a-8af6-5365dd37a9b2)))))), Response(None, ExecutionComplete(f70f6da6-f03b-4ba4-a225-8bb50e623261))) did not contain the same elements as List(Response(Some(108b992e-6b36-4502-88a3-6cd6eeb530a5), PushContextResponse(f70f6da6-f03b-4ba4-a225-8bb50e623261)), Response(None, ExecutionUpdate(f70f6da6-f03b-4ba4-a225-8bb50e623261, List(Diagnostic(Error, Some("The name `foo` could not be found."), Some(/var/folders/bq/77bm14_16vd4xfpb13_2w3q80000gn/T/enso-test-packages2371695501570739082/src/Main.enso), Some(Range(Position(3, 12), Position(3, 15))), None, Vector())))), Response(None, ExpressionUpdates(f70f6da6-f03b-4ba4-a225-8bb50e623261, Set(ExpressionUpdate(c3b294d2-3cee-4db9-87b5-af066dd76bfa, Some(Vector("Standard.Base.Panic.Panic")), None, Vector(ExecutionTime(0)), false, true, Panic("Compile error: The name `foo` could not be found.", List(c3b294d2-3cee-4db9-87b5-af066dd76bfa)))))), Response(None, ExpressionUpdates(f70f6da6-f03b-4ba4-a225-8bb50e623261, Set(ExpressionUpdate(06065f0d-a0ca-4c69-9d24-3519d644192e, Some(Vector("Standard.Base.Panic.Panic")), None, Vector(ExecutionTime(0)), false, true, Panic("Compile error: The name `foo` could not be found.", List(c3b294d2-3cee-4db9-87b5-af066dd76bfa)))))), Response(None, ExpressionUpdates(f70f6da6-f03b-4ba4-a225-8bb50e623261, Set(ExpressionUpdate(f0e5fc37-e729-4d9a-8af6-5365dd37a9b2, Some(Vector("Standard.Base.Panic.Panic")), Some(MethodCall(MethodPointer("Standard.Base.IO", "Standard.Base.IO", "println"), Vector())), Vector(ExecutionTime(0)), false, true, Panic("Compile error: The name `foo` could not be found.", List(c3b294d2-3cee-4db9-87b5-af066dd76bfa)))))), Response(None, ExecutionComplete(f70f6da6-f03b-4ba4-a225-8bb50e623261)))
|
org.enso.interpreter.test.instrument.RuntimeErrorsTest ► should send updates when panic changes in expression:
/Users/runner/work/enso/enso/target/test-results/TEST-org.enso.interpreter.test.instrument.RuntimeErrorsTest.xml#L0
Failed test found in:
/Users/runner/work/enso/enso/target/test-results/TEST-org.enso.interpreter.test.instrument.RuntimeErrorsTest.xml
Error:
org.scalatest.exceptions.TestFailedException: List(Response(Some(3164b4b2-d438-4a42-abab-86e1c70e6876), PushContextResponse(e14e9f6b-baef-477c-83db-962d7a4564fc)), Response(None, ExpressionUpdates(e14e9f6b-baef-477c-83db-962d7a4564fc, Set(ExpressionUpdate(ee3b310f-575e-41ab-8a07-bbde335b9e7b, Some(Vector("Standard.Base.Panic.Panic")), Some(MethodCall(MethodPointer("Standard.Base.Panic", "Standard.Base.Panic.Panic", "throw"), Vector())), Vector(ExecutionTime(0)), false, true, Panic("MyError1", List(ee3b310f-575e-41ab-8a07-bbde335b9e7b)))))), Response(None, ExpressionUpdates(e14e9f6b-baef-477c-83db-962d7a4564fc, Set(ExpressionUpdate(ce9f4b64-bb89-4609-8721-844a80604fef, Some(Vector("Standard.Base.Panic.Panic")), None, Vector(ExecutionTime(0)), false, true, Panic("MyError1", List(ee3b310f-575e-41ab-8a07-bbde335b9e7b)))))), Response(None, ExpressionUpdates(e14e9f6b-baef-477c-83db-962d7a4564fc, Set(ExpressionUpdate(a44f6452-c0e3-432b-9024-e3e855aa063c, Some(Vector("Standard.Base.Panic.Panic")), Some(MethodCall(MethodPointer("Standard.Base.IO", "Standard.Base.IO", "println"), Vector())), Vector(ExecutionTime(0)), false, true, Panic("MyError1", List(a44f6452-c0e3-432b-9024-e3e855aa063c)))))), Response(None, ExecutionComplete(e14e9f6b-baef-477c-83db-962d7a4564fc))) did not contain the same elements as List(Response(Some(3164b4b2-d438-4a42-abab-86e1c70e6876), PushContextResponse(e14e9f6b-baef-477c-83db-962d7a4564fc)), Response(None, ExpressionUpdates(e14e9f6b-baef-477c-83db-962d7a4564fc, Set(ExpressionUpdate(ee3b310f-575e-41ab-8a07-bbde335b9e7b, Some(Vector("Standard.Base.Panic.Panic")), Some(MethodCall(MethodPointer("Standard.Base.Panic", "Standard.Base.Panic.Panic", "throw"), Vector())), Vector(ExecutionTime(0)), false, true, Panic("MyError1", List(ee3b310f-575e-41ab-8a07-bbde335b9e7b)))))), Response(None, ExpressionUpdates(e14e9f6b-baef-477c-83db-962d7a4564fc, Set(ExpressionUpdate(ce9f4b64-bb89-4609-8721-844a80604fef, Some(Vector("Standard.Base.Panic.Panic")), None, Vector(ExecutionTime(0)), false, true, Panic("MyError1", List(ee3b310f-575e-41ab-8a07-bbde335b9e7b)))))), Response(None, ExpressionUpdates(e14e9f6b-baef-477c-83db-962d7a4564fc, Set(ExpressionUpdate(a44f6452-c0e3-432b-9024-e3e855aa063c, Some(Vector("Standard.Base.Panic.Panic")), Some(MethodCall(MethodPointer("Standard.Base.IO", "Standard.Base.IO", "println"), Vector())), Vector(ExecutionTime(0)), false, true, Panic("MyError1", List(ee3b310f-575e-41ab-8a07-bbde335b9e7b)))))), Response(None, ExecutionComplete(e14e9f6b-baef-477c-83db-962d7a4564fc)))
|
org.enso.interpreter.test.instrument.RuntimeErrorsTest ► should send updates when panic is resolved in method:
/Users/runner/work/enso/enso/target/test-results/TEST-org.enso.interpreter.test.instrument.RuntimeErrorsTest.xml#L0
Failed test found in:
/Users/runner/work/enso/enso/target/test-results/TEST-org.enso.interpreter.test.instrument.RuntimeErrorsTest.xml
Error:
org.scalatest.exceptions.TestFailedException: List(Response(Some(b1a220f0-8797-4028-93ed-f95ff690618d), PushContextResponse(fb36ea34-d654-4fec-a37e-aada4d2987bf)), Response(None, ExpressionUpdates(fb36ea34-d654-4fec-a37e-aada4d2987bf, Set(ExpressionUpdate(dfc84066-21e7-4523-83aa-e7d97ea4c7e9, Some(Vector("Standard.Base.Panic.Panic")), Some(MethodCall(MethodPointer("Enso_Test.Test.Main", "Enso_Test.Test.Main", "foo"), Vector())), Vector(ExecutionTime(0)), false, true, Panic("Integer", List(dfc84066-21e7-4523-83aa-e7d97ea4c7e9)))))), Response(None, ExpressionUpdates(fb36ea34-d654-4fec-a37e-aada4d2987bf, Set(ExpressionUpdate(09e8dcff-866b-47f4-8c34-30c7acd20b7d, Some(Vector("Standard.Base.Panic.Panic")), None, Vector(ExecutionTime(0)), false, true, Panic("Integer", List(dfc84066-21e7-4523-83aa-e7d97ea4c7e9)))))), Response(None, ExpressionUpdates(fb36ea34-d654-4fec-a37e-aada4d2987bf, Set(ExpressionUpdate(733ace69-0881-4725-b0a7-5164ca54e358, Some(Vector("Standard.Base.Panic.Panic")), Some(MethodCall(MethodPointer("Standard.Base.IO", "Standard.Base.IO", "println"), Vector())), Vector(ExecutionTime(0)), false, true, Panic("Integer", List(733ace69-0881-4725-b0a7-5164ca54e358)))))), Response(None, ExecutionComplete(fb36ea34-d654-4fec-a37e-aada4d2987bf))) did not contain the same elements as List(Response(Some(b1a220f0-8797-4028-93ed-f95ff690618d), PushContextResponse(fb36ea34-d654-4fec-a37e-aada4d2987bf)), Response(None, ExpressionUpdates(fb36ea34-d654-4fec-a37e-aada4d2987bf, Set(ExpressionUpdate(dfc84066-21e7-4523-83aa-e7d97ea4c7e9, Some(Vector("Standard.Base.Panic.Panic")), Some(MethodCall(MethodPointer("Enso_Test.Test.Main", "Enso_Test.Test.Main", "foo"), Vector())), Vector(ExecutionTime(0)), false, true, Panic("Integer", List(dfc84066-21e7-4523-83aa-e7d97ea4c7e9)))))), Response(None, ExpressionUpdates(fb36ea34-d654-4fec-a37e-aada4d2987bf, Set(ExpressionUpdate(09e8dcff-866b-47f4-8c34-30c7acd20b7d, Some(Vector("Standard.Base.Panic.Panic")), None, Vector(ExecutionTime(0)), false, true, Panic("Integer", List(dfc84066-21e7-4523-83aa-e7d97ea4c7e9)))))), Response(None, ExpressionUpdates(fb36ea34-d654-4fec-a37e-aada4d2987bf, Set(ExpressionUpdate(733ace69-0881-4725-b0a7-5164ca54e358, Some(Vector("Standard.Base.Panic.Panic")), Some(MethodCall(MethodPointer("Standard.Base.IO", "Standard.Base.IO", "println"), Vector())), Vector(ExecutionTime(0)), false, true, Panic("Integer", List(dfc84066-21e7-4523-83aa-e7d97ea4c7e9)))))), Response(None, ExecutionComplete(fb36ea34-d654-4fec-a37e-aada4d2987bf)))
|
org.enso.interpreter.test.instrument.RuntimeVisualizationsTest ► should run visualization expression propagating panic:
/Users/runner/work/enso/enso/target/test-results/TEST-org.enso.interpreter.test.instrument.RuntimeVisualizationsTest.xml#L0
Failed test found in:
/Users/runner/work/enso/enso/target/test-results/TEST-org.enso.interpreter.test.instrument.RuntimeVisualizationsTest.xml
Error:
org.scalatest.exceptions.TestFailedException: List(Response(Some(af4af5ae-f7d3-4fd7-a8fb-0cdd38ecf401), VisualizationAttached()), Response(None, ExpressionUpdates(684a115c-c387-4743-897b-8ffcd884370e, Set(ExpressionUpdate(2829f6cf-0cb3-4388-8a64-a494fc687612, Some(Vector("Standard.Base.Panic.Panic")), Some(MethodCall(MethodPointer("Standard.Base.Panic", "Standard.Base.Panic.Panic", "throw"), Vector())), Vector(ExecutionTime(0)), false, true, Panic("Integer", List(2829f6cf-0cb3-4388-8a64-a494fc687612)))))), Response(None, VisualizationEvaluationFailed(VisualizationContext(c5af2574-7bcd-4283-80f8-eca04adf465d, 684a115c-c387-4743-897b-8ffcd884370e, 2829f6cf-0cb3-4388-8a64-a494fc687612), "42", Some(Diagnostic(Error, Some("42"), None, None, None, Vector(StackTraceElement("<inline_source>.Enso_Test.Test.Main", Some(/var/folders/bq/77bm14_16vd4xfpb13_2w3q80000gn/T/enso-test-packages12951029982734397032/src/Main.enso), Some(Range(Position(3, 4), Position(3, 18))), Some(2829f6cf-0cb3-4388-8a64-a494fc687612))))))), Response(None, ExecutionComplete(684a115c-c387-4743-897b-8ffcd884370e))) did not contain the same elements as List(Response(Some(af4af5ae-f7d3-4fd7-a8fb-0cdd38ecf401), VisualizationAttached()), Response(None, ExpressionUpdates(684a115c-c387-4743-897b-8ffcd884370e, Set(ExpressionUpdate(2829f6cf-0cb3-4388-8a64-a494fc687612, Some(Vector("Standard.Base.Panic.Panic")), Some(MethodCall(MethodPointer("Standard.Base.Panic", "Standard.Base.Panic.Panic", "throw"), Vector())), Vector(ExecutionTime(0)), false, true, Panic("Integer", List(2829f6cf-0cb3-4388-8a64-a494fc687612)))))), Response(None, VisualizationEvaluationFailed(VisualizationContext(c5af2574-7bcd-4283-80f8-eca04adf465d, 684a115c-c387-4743-897b-8ffcd884370e, 2829f6cf-0cb3-4388-8a64-a494fc687612), "42", Some(Diagnostic(Error, Some("42"), Some(/var/folders/bq/77bm14_16vd4xfpb13_2w3q80000gn/T/enso-test-packages12951029982734397032/src/Main.enso), Some(Range(Position(3, 4), Position(3, 18))), Some(2829f6cf-0cb3-4388-8a64-a494fc687612), Vector(StackTraceElement("Main.main", Some(/var/folders/bq/77bm14_16vd4xfpb13_2w3q80000gn/T/enso-test-packages12951029982734397032/src/Main.enso), Some(Range(Position(3, 4), Position(3, 18))), Some(2829f6cf-0cb3-4388-8a64-a494fc687612))))))), Response(None, ExecutionComplete(684a115c-c387-4743-897b-8ffcd884370e)))
|
Artifacts
Produced during runtime
Name | Size | |
---|---|---|
gui-static
|
15.9 MB |
|